Target
5-hydroxytryptamine receptor 1A
Ligand
BDBM50145585
Substrate
Meas. Tech.
ChEMBL_1556024 (CHEMBL3767883)
Ki
1.1±n/a nM
Citation
 Fiorino, FCiano, AMagli, ESeverino, BCorvino, APerissutti, EFrecentese, FDi Vaio, PIzzo, AACapasso, RMassarelli, PNencini, CRossi, IKedzierska, EOrzelska-Gòrka, JBielenica, ASantagada, VCaliendo, G Synthesis, in vitro and in vivo pharmacological evaluation of serotoninergic ligands containing an isonicotinic nucleus. Eur J Med Chem 110:133-50 (2016)  
Target
Name:
5-hydroxytryptamine receptor 1A
Synonyms:
5-HT-1A 5-HT1A 5-hydroxytryptamine receptor 1A (5HT1A) 5ht1a Htr1a Serotonin 1a (5-HT1a) receptor/Adrenergic receptor alpha-1 | Serotonin receptor 1A
Type:
G Protein-Coupled Receptor (GPCR)
Mol. Mass.:
46445.29
Organism:
Rattus norvegicus (rat)
Description:
Binding assays were performed using rat hippocampal membranes.
Residue:
422
  
Inhibitor
Name:
BDBM50145585
Synonyms:
CHEMBL3765362
Type:
Small organic molecule
Emp. Form.:
C17H21N5O
Mol. Mass.:
311.3815
SMILES:
O=C(NCCN1CCN(CC1)c1ccccn1)c1ccncc1
: