Target
Amine oxidase [flavin-containing] B
Ligand
BDBM50145630
Substrate
Meas. Tech.
ChEMBL_1556051 (CHEMBL3767910)
Ki
3.5±n/a nM
Citation
 Mostert, SPetzer, APetzer, JP Inhibition of monoamine oxidase by benzoxathiolone analogues. Bioorg Med Chem Lett 26:1200-4 (2016)  
Target
Name:
Amine oxidase [flavin-containing] B
Synonyms:
AOFB_HUMAN MAOB Monoamine oxidase type B (MAO B) Monoamine oxidase type B (MAOB)
Type:
Protein
Mol. Mass.:
58768.76
Organism:
Homo sapiens (Human)
Description:
P27338
Residue:
520
  
Inhibitor
Name:
BDBM50145630
Synonyms:
CHEMBL3764447
Type:
Small organic molecule
Emp. Form.:
C14H9ClO3S
Mol. Mass.:
292.737
SMILES:
Clc1ccc(COc2ccc3sc(=O)oc3c2)cc1
: