Target
Choline kinase alpha
Ligand
BDBM50145929
Substrate
Meas. Tech.
ChEMBL_1554155 (CHEMBL3769127)
Kd
4300±n/a nM
Citation
 Zech, SGKohlmann, AZhou, TLi, FSquillace, RMParillon, LEGreenfield, MTMiller, DPQi, JThomas, RMWang, YXu, YMiret, JJShakespeare, WCZhu, XDalgarno, DC Novel Small Molecule Inhibitors of Choline Kinase Identified by Fragment-Based Drug Discovery. J Med Chem 59:671-86 (2016)  
Target
Name:
Choline kinase alpha
Synonyms:
CHK CHKA_HUMAN Choline kinase alpha
Type:
PROTEIN
Mol. Mass.:
52248.44
Organism:
Homo sapiens (Human)
Description:
ChEMBL_1290064
Residue:
457
  
Inhibitor
Name:
BDBM50145929
Synonyms:
CHEMBL3765650
Type:
Small organic molecule
Emp. Form.:
C17H22N2
Mol. Mass.:
254.37
SMILES:
CN1CCCN(Cc2ccc3ccccc3c2)CC1
: