Target
Serine/threonine-protein kinase B-raf
Ligand
BDBM50146588
Substrate
Meas. Tech.
ChEMBL_1555282 (CHEMBL3768994)
IC50
>12500±n/a nM
Citation
 Garamvölgyi, RDobos, JSipos, ABoros, SIllyés, EBaska, FKékesi, LSzabadkai, ISzántai-Kis, CKéri, GOrfi, L Design and synthesis of new imidazo[1,2-a]pyridine and imidazo[1,2-a]pyrazine derivatives with antiproliferative activity against melanoma cells. Eur J Med Chem 108:623-43 (2016)  
Target
Name:
Serine/threonine-protein kinase B-raf
Synonyms:
B-RAF B-Raf proto-oncogene serine/threonine-protein kinase BRAF1 RAFB1 v-Raf murine sarcoma viral oncogene homolog B1
Type:
Serine/threonine-protein kinase
Mol. Mass.:
84446.00
Organism:
Homo sapiens (Human)
Description:
P15056
Residue:
766
  
Inhibitor
Name:
BDBM50146588
Synonyms:
CHEMBL3764145
Type:
Small organic molecule
Emp. Form.:
C26H16Cl2F2N6O2
Mol. Mass.:
553.347
SMILES:
Fc1ccc(NC(=O)Nc2cccc(c2)-c2cnc3c(NC(=O)c4cc(Cl)cc(Cl)c4)nccn23)c(F)c1
: