Target
Serine/threonine-protein kinase B-raf
Ligand
BDBM50146591
Substrate
Meas. Tech.
ChEMBL_1555282 (CHEMBL3768994)
IC50
>12500±n/a nM
Citation
 Garamvölgyi, RDobos, JSipos, ABoros, SIllyés, EBaska, FKékesi, LSzabadkai, ISzántai-Kis, CKéri, GOrfi, L Design and synthesis of new imidazo[1,2-a]pyridine and imidazo[1,2-a]pyrazine derivatives with antiproliferative activity against melanoma cells. Eur J Med Chem 108:623-43 (2016)  
Target
Name:
Serine/threonine-protein kinase B-raf
Synonyms:
B-RAF B-Raf proto-oncogene serine/threonine-protein kinase BRAF1 RAFB1 v-Raf murine sarcoma viral oncogene homolog B1
Type:
Serine/threonine-protein kinase
Mol. Mass.:
84446.00
Organism:
Homo sapiens (Human)
Description:
P15056
Residue:
766
  
Inhibitor
Name:
BDBM50146591
Synonyms:
CHEMBL3763692
Type:
Small organic molecule
Emp. Form.:
C28H16ClF7N6O2
Mol. Mass.:
636.907
SMILES:
Fc1ccc(cc1C(F)(F)F)C(=O)Nc1nccn2c(cnc12)-c1cccc(NC(=O)Nc2ccc(Cl)c(c2)C(F)(F)F)c1
: