Target
Inhibitor of nuclear factor kappa-B kinase subunit beta
Ligand
BDBM50146942
Substrate
Meas. Tech.
ChEMBL_1553191 (CHEMBL3767149)
IC50
840±n/a nM
Citation
 Kim, DKim, YGSeo, JHShin, KJ Identification and characterization of potent, selective and metabolically stable IKKß inhibitor. Bioorg Med Chem Lett 26:1120-3 (2016)  
Target
Name:
Inhibitor of nuclear factor kappa-B kinase subunit beta
Synonyms:
I-kappa-B Kinase 2 (IKK-beta) I-kappa-B-kinase beta IKBKB IKK-beta IKK2/IKK1 IKKB_HUMAN Inhibitor of nuclear factor kappa B kinase beta subunit Nuclear factor NF-kappa-B inhibitor kinase beta
Type:
Serine/threonine-protein kinase
Mol. Mass.:
86554.39
Organism:
Homo sapiens (Human)
Description:
GST-tagged IKK-2 was expressed in High Five cells and purified.
Residue:
756
  
Inhibitor
Name:
BDBM50146942
Synonyms:
CHEMBL3763983
Type:
Small organic molecule
Emp. Form.:
C32H34N4O4S2
Mol. Mass.:
602.767
SMILES:
CN1CCN(CCCOc2ccc(cc2)N2C(=S)S\C(=C/c3ccc(Oc4ccc(NC(C)=O)cc4)cc3)C2=O)CC1
: