Target
Carbonic anhydrase 2
Ligand
BDBM10877
Substrate
Meas. Tech.
ChEMBL_1553894 (CHEMBL3767548)
Ki
125±n/a nM
Citation
 Vullo, DDe Luca, VDel Prete, SCarginale, VScozzafava, AOsman, SMAlOthman, ZCapasso, CSupuran, CT Sulfonamide inhibition studies of theż-carbonic anhydrase from the Antarctic bacterium Colwellia psychrerythraea. Bioorg Med Chem Lett 26:1253-9 (2016)  
Target
Name:
Carbonic anhydrase 2
Synonyms:
CA-II CAC Carbonate dehydratase II Carbonic anhydrase 2 (CA-II) Carbonic anhydrase C Carbonic anhydrase II (CA-II) Carbonic anhydrase II (hCA II) | Carbonic anhydrase isoenzyme II (hCA II)
Type:
Enzyme
Mol. Mass.:
29250.71
Organism:
Homo sapiens (Human)
Description:
P00918
Residue:
260
  
Inhibitor
Name:
BDBM10877
Synonyms:
4-(2-hydroxyethyl)benzene-1-sulfonamide JMC522226 Compound 21 aromatic/heteroaromatic sulfonamide 22
Type:
Small organic molecule
Emp. Form.:
C8H11NO3S
Mol. Mass.:
201.243
SMILES:
NS(=O)(=O)c1ccc(CCO)cc1
: