Target
Sucrase-isomaltase, intestinal
Ligand
BDBM50147017
Substrate
Meas. Tech.
ChEMBL_1554222 (CHEMBL3766261)
IC50
510±n/a nM
Citation
 Liu, DHe, WWang, ZLiu, LWang, CZhang, CWang, CWang, YTanabe, GMuraoka, OWu, XWu, LXie, W Design, synthesis and biological evaluation of 3'-benzylated analogs of 3'-epi-neoponkoranol as potenta-glucosidase inhibitors. Eur J Med Chem 110:224-36 (2016)  
Target
Name:
Sucrase-isomaltase, intestinal
Synonyms:
SUIS_RAT Sucrase-isomaltase | alpha-Glucosidase (α-Glucosidase)
Type:
Enzyme
Mol. Mass.:
210329.04
Organism:
Rattus norvegicus (Rat)
Description:
P23739
Residue:
1841
  
Inhibitor
Name:
BDBM50147017
Synonyms:
CHEMBL3763423
Type:
Small organic molecule
Emp. Form.:
C18H28Cl2O8S
Mol. Mass.:
475.381
SMILES:
[Cl-].OC[C@H](O)[C@@H](O)[C@@H](OCc1cccc(Cl)c1)[C@H](O)C[S+]1C[C@@H](O)[C@H](O)[C@H]1CO
: