Target
Sucrase-isomaltase, intestinal
Ligand
BDBM50147107
Substrate
Meas. Tech.
ChEMBL_1554225 (CHEMBL3766264)
Ki
216±n/a nM
Citation
 Liu, DHe, WWang, ZLiu, LWang, CZhang, CWang, CWang, YTanabe, GMuraoka, OWu, XWu, LXie, W Design, synthesis and biological evaluation of 3'-benzylated analogs of 3'-epi-neoponkoranol as potenta-glucosidase inhibitors. Eur J Med Chem 110:224-36 (2016)  
Target
Name:
Sucrase-isomaltase, intestinal
Synonyms:
SUIS_RAT Sucrase-isomaltase | alpha-Glucosidase (α-Glucosidase)
Type:
Enzyme
Mol. Mass.:
210329.04
Organism:
Rattus norvegicus (Rat)
Description:
P23739
Residue:
1841
  
Inhibitor
Name:
BDBM50147107
Synonyms:
CHEMBL3763319
Type:
Small organic molecule
Emp. Form.:
C19H28ClF3O8S
Mol. Mass.:
508.934
SMILES:
[Cl-].OC[C@H](O)[C@@H](O)[C@@H](OCc1ccccc1C(F)(F)F)[C@H](O)C[S+]1C[C@@H](O)[C@H](O)[C@H]1CO
: