Target
Amine oxidase [flavin-containing] B
Ligand
BDBM50147608
Substrate
Meas. Tech.
ChEMBL_1553290 (CHEMBL3767522)
IC50
14700±n/a nM
Citation
 Xie, SSLan, JSWang, XWang, ZMJiang, NLi, FWu, JJWang, JKong, LY Design, synthesis and biological evaluation of novel donepezil-coumarin hybrids as multi-target agents for the treatment of Alzheimer's disease. Bioorg Med Chem 24:1528-39 (2016)  
Target
Name:
Amine oxidase [flavin-containing] B
Synonyms:
AOFB_HUMAN MAOB Monoamine oxidase type B (MAO B) Monoamine oxidase type B (MAOB)
Type:
Protein
Mol. Mass.:
58768.76
Organism:
Homo sapiens (Human)
Description:
P27338
Residue:
520
  
Inhibitor
Name:
BDBM50147608
Synonyms:
CHEMBL3764762
Type:
Small organic molecule
Emp. Form.:
C24H27ClN2O3
Mol. Mass.:
426.936
SMILES:
Cc1c(Cl)c(=O)oc2cc(OCCNC3CCN(Cc4ccccc4)CC3)ccc12
: