Target
Acetylcholinesterase
Ligand
BDBM50147608
Substrate
Meas. Tech.
ChEMBL_1553281 (CHEMBL3767513)
IC50
1820±n/a nM
Citation
 Xie, SSLan, JSWang, XWang, ZMJiang, NLi, FWu, JJWang, JKong, LY Design, synthesis and biological evaluation of novel donepezil-coumarin hybrids as multi-target agents for the treatment of Alzheimer's disease. Bioorg Med Chem 24:1528-39 (2016)  
Target
Name:
Acetylcholinesterase
Synonyms:
ACES_HUMAN Acetylcholinesterase (AChE) | Acetylcholinesterase (human AChE)
Type:
Enzyme
Mol. Mass.:
67792.70
Organism:
Homo sapiens (Human)
Description:
P22303
Residue:
614
  
Inhibitor
Name:
BDBM50147608
Synonyms:
CHEMBL3764762
Type:
Small organic molecule
Emp. Form.:
C24H27ClN2O3
Mol. Mass.:
426.936
SMILES:
Cc1c(Cl)c(=O)oc2cc(OCCNC3CCN(Cc4ccccc4)CC3)ccc12
: