Target
Carbonic anhydrase 1
Ligand
BDBM50152968
Substrate
Meas. Tech.
ChEMBL_1554921 (CHEMBL3767073)
Ki
500±n/a nM
Citation
 Vullo, DDel Prete, SDe Luca, VCarginale, VFerraroni, MDedeoglu, NOsman, SMAlOthman, ZCapasso, CSupuran, CT Anion inhibition studies of the฿-carbonic anhydrase from the pathogenic bacterium Vibrio cholerae. Bioorg Med Chem Lett 26:1406-10 (2016)  
Target
Name:
Carbonic anhydrase 1
Synonyms:
CA-I CAB Carbonate dehydratase I Carbonic anhydrase 1 (CA I) Carbonic anhydrase 1 (Recombinant CA I) Carbonic anhydrase B Carbonic anhydrase I (CA I) Carbonic anhydrase I (CAI) Carbonic anhydrase isoenzyme I (hCA I) | hCA
Type:
Enzyme
Mol. Mass.:
28873.37
Organism:
Homo sapiens (Human)
Description:
P00915
Residue:
261
  
Inhibitor
Name:
BDBM50152968
Synonyms:
Blausaeure Cyanwasserstoff formonitrile hydrocyanic acid | hydrogen cyanide
Type:
Small organic molecule
Emp. Form.:
CHN
Mol. Mass.:
27.0253
SMILES:
C#N
: