Target
Orexin receptor type 2
Ligand
BDBM50148575
Substrate
Meas. Tech.
ChEMBL_1558174 (CHEMBL3772018)
Ki
0.100000±n/a nM
Citation
 Roecker, AJCox, CDColeman, PJ Orexin Receptor Antagonists: New Therapeutic Agents for the Treatment of Insomnia. J Med Chem 59:504-30 (2016)  
Target
Name:
Orexin receptor type 2
Synonyms:
HCRTR2 OX2R_HUMAN Orexin receptor type 2 (OR-2) Orexin receptor type 2 (OX2R) Ox-2-R | Ox2-R
Type:
Protein
Mol. Mass.:
50710.53
Organism:
Homo sapiens (Human)
Description:
O43614
Residue:
444
  
Inhibitor
Name:
BDBM50148575
Synonyms:
CHEMBL3770503
Type:
Small organic molecule
Emp. Form.:
C24H27FN4O2
Mol. Mass.:
422.4952
SMILES:
C[C@@H]1CC[C@@H](COc2ccc(F)c(C)c2)CN1C(=O)c1cc(C)ccc1-n1nccn1
: