Target
Ribosyldihydronicotinamide dehydrogenase [quinone]
Ligand
BDBM23926
Substrate
Meas. Tech.
ChEMBL_1558659 (CHEMBL3771536)
IC50
1400±n/a nM
Citation
 Alnabulsi, SSantina, ERusso, IHussein, BKadirvel, MChadwick, ABichenkova, EVBryce, RANolan, KDemonacos, CStratford, IJFreeman, S Non-symmetrical furan-amidines as novel leads for the treatment of cancer and malaria. Eur J Med Chem 111:33-45 (2016)  
Target
Name:
Ribosyldihydronicotinamide dehydrogenase [quinone]
Synonyms:
Metallothionein-3 NQO2 NRH dehydrogenase [quinone] 2 QR2 Quinone reductase 2 (NQO2) | Ribosyldihydronicotinamide dehydrogenase [quinone]
Type:
Protein
Mol. Mass.:
25917.25
Organism:
Homo sapiens (Human)
Description:
P16083
Residue:
231
  
Inhibitor
Name:
BDBM23926
Synonyms:
(E)-resveratrol CHEMBL165 Stilbene, 2f cid_445154 trans-resveratrol
Type:
Small organic molecule
Emp. Form.:
C14H12O3
Mol. Mass.:
228.2433
SMILES:
Oc1ccc(\C=C\c2cc(O)cc(O)c2)cc1
: