Target
Ribosyldihydronicotinamide dehydrogenase [quinone]
Ligand
BDBM50150961
Substrate
Meas. Tech.
ChEMBL_1558657 (CHEMBL3771534)
IC50
332±n/a nM
Citation
 Alnabulsi, SSantina, ERusso, IHussein, BKadirvel, MChadwick, ABichenkova, EVBryce, RANolan, KDemonacos, CStratford, IJFreeman, S Non-symmetrical furan-amidines as novel leads for the treatment of cancer and malaria. Eur J Med Chem 111:33-45 (2016)  
Target
Name:
Ribosyldihydronicotinamide dehydrogenase [quinone]
Synonyms:
Metallothionein-3 NQO2 NRH dehydrogenase [quinone] 2 QR2 Quinone reductase 2 (NQO2) | Ribosyldihydronicotinamide dehydrogenase [quinone]
Type:
Protein
Mol. Mass.:
25917.25
Organism:
Homo sapiens (Human)
Description:
P16083
Residue:
231
  
Inhibitor
Name:
BDBM50150961
Synonyms:
CHEMBL3770627
Type:
Small organic molecule
Emp. Form.:
C19H19N3O2
Mol. Mass.:
321.3731
SMILES:
CC(O)=O.NC(=N)c1ccc(cc1)-c1ccc([nH]1)-c1ccccc1
: