Target
Ribosyldihydronicotinamide dehydrogenase [quinone]
Ligand
BDBM50150965
Substrate
Meas. Tech.
ChEMBL_1558657 (CHEMBL3771534)
IC50
202±n/a nM
Citation
 Alnabulsi, SSantina, ERusso, IHussein, BKadirvel, MChadwick, ABichenkova, EVBryce, RANolan, KDemonacos, CStratford, IJFreeman, S Non-symmetrical furan-amidines as novel leads for the treatment of cancer and malaria. Eur J Med Chem 111:33-45 (2016)  
Target
Name:
Ribosyldihydronicotinamide dehydrogenase [quinone]
Synonyms:
Metallothionein-3 NQO2 NRH dehydrogenase [quinone] 2 QR2 Quinone reductase 2 (NQO2) | Ribosyldihydronicotinamide dehydrogenase [quinone]
Type:
Protein
Mol. Mass.:
25917.25
Organism:
Homo sapiens (Human)
Description:
P16083
Residue:
231
  
Inhibitor
Name:
BDBM50150965
Synonyms:
CHEMBL3771261
Type:
Small organic molecule
Emp. Form.:
C21H22N2O3
Mol. Mass.:
350.411
SMILES:
CC(O)=O.CCc1ccc(cc1)-c1ccc(o1)-c1ccc(cc1)C(N)=N
: