Target
Ribosyldihydronicotinamide dehydrogenase [quinone]
Ligand
BDBM50151020
Substrate
Meas. Tech.
ChEMBL_1558657 (CHEMBL3771534)
IC50
98±n/a nM
Citation
 Alnabulsi, SSantina, ERusso, IHussein, BKadirvel, MChadwick, ABichenkova, EVBryce, RANolan, KDemonacos, CStratford, IJFreeman, S Non-symmetrical furan-amidines as novel leads for the treatment of cancer and malaria. Eur J Med Chem 111:33-45 (2016)  
Target
Name:
Ribosyldihydronicotinamide dehydrogenase [quinone]
Synonyms:
Metallothionein-3 NQO2 NRH dehydrogenase [quinone] 2 QR2 Quinone reductase 2 (NQO2) | Ribosyldihydronicotinamide dehydrogenase [quinone]
Type:
Protein
Mol. Mass.:
25917.25
Organism:
Homo sapiens (Human)
Description:
P16083
Residue:
231
  
Inhibitor
Name:
BDBM50151020
Synonyms:
CHEMBL3769656
Type:
Small organic molecule
Emp. Form.:
C19H17FN2O3
Mol. Mass.:
340.3483
SMILES:
CC(O)=O.NC(=N)c1ccc(cc1)-c1ccc(o1)-c1cccc(F)c1
: