Target
Ribosyldihydronicotinamide dehydrogenase [quinone]
Ligand
BDBM50151029
Substrate
Meas. Tech.
ChEMBL_1558666 (CHEMBL3771543)
IC50
50±n/a nM
Citation
 Alnabulsi, SSantina, ERusso, IHussein, BKadirvel, MChadwick, ABichenkova, EVBryce, RANolan, KDemonacos, CStratford, IJFreeman, S Non-symmetrical furan-amidines as novel leads for the treatment of cancer and malaria. Eur J Med Chem 111:33-45 (2016)  
Target
Name:
Ribosyldihydronicotinamide dehydrogenase [quinone]
Synonyms:
Metallothionein-3 NQO2 NRH dehydrogenase [quinone] 2 QR2 Quinone reductase 2 (NQO2) | Ribosyldihydronicotinamide dehydrogenase [quinone]
Type:
Protein
Mol. Mass.:
25917.25
Organism:
Homo sapiens (Human)
Description:
P16083
Residue:
231
  
Inhibitor
Name:
BDBM50151029
Synonyms:
CHEMBL3770283
Type:
Small organic molecule
Emp. Form.:
C20H20N4O
Mol. Mass.:
332.399
SMILES:
Cc1c(C)c(oc1-c1ccc(cc1)C(N)=N)-c1ccc(cc1)C(N)=N
: