Target
Transcription intermediary factor 1-alpha
Ligand
BDBM50150760
Substrate
Meas. Tech.
ChEMBL_1560322 (CHEMBL3779314)
EC50
3200±n/a nM
Citation
 Palmer, WSPoncet-Montange, GLiu, GPetrocchi, AReyna, NSubramanian, GTheroff, JYau, AKost-Alimova, MBardenhagen, JPLeo, EShepard, HETieu, TNShi, XZhan, YZhao, SBarton, MCDraetta, GToniatti, CJones, PGeck Do, MAndersen, JN Structure-Guided Design of IACS-9571, a Selective High-Affinity Dual TRIM24-BRPF1 Bromodomain Inhibitor. J Med Chem 59:1440-54 (2016)  
Target
Name:
Transcription intermediary factor 1-alpha
Synonyms:
6.3.2.- RING finger protein 82 RNF82 TIF1-alpha TIF1A_HUMAN Transcription intermediary factor 1-alpha | Tripartite motif-containing protein 24
Type:
PROTEIN
Mol. Mass.:
116839.55
Organism:
Homo sapiens (Human)
Description:
ChEMBL_107998
Residue:
1050
  
Inhibitor
Name:
BDBM50150760
Synonyms:
CHEMBL3774883
Type:
Small organic molecule
Emp. Form.:
C29H36N4O7S
Mol. Mass.:
584.684
SMILES:
COc1ccc(cc1OC)S(=O)(=O)Nc1cc2n(C)c(=O)n(C)c2cc1Oc1cccc(OCCCCN(C)C)c1
: