Target
Transcription intermediary factor 1-alpha
Ligand
BDBM50150811
Substrate
Meas. Tech.
ChEMBL_1560322 (CHEMBL3779314)
EC50
950±n/a nM
Citation
 Palmer, WSPoncet-Montange, GLiu, GPetrocchi, AReyna, NSubramanian, GTheroff, JYau, AKost-Alimova, MBardenhagen, JPLeo, EShepard, HETieu, TNShi, XZhan, YZhao, SBarton, MCDraetta, GToniatti, CJones, PGeck Do, MAndersen, JN Structure-Guided Design of IACS-9571, a Selective High-Affinity Dual TRIM24-BRPF1 Bromodomain Inhibitor. J Med Chem 59:1440-54 (2016)  
Target
Name:
Transcription intermediary factor 1-alpha
Synonyms:
6.3.2.- RING finger protein 82 RNF82 TIF1-alpha TIF1A_HUMAN Transcription intermediary factor 1-alpha | Tripartite motif-containing protein 24
Type:
PROTEIN
Mol. Mass.:
116839.55
Organism:
Homo sapiens (Human)
Description:
ChEMBL_107998
Residue:
1050
  
Inhibitor
Name:
BDBM50150811
Synonyms:
CHEMBL3775073
Type:
Small organic molecule
Emp. Form.:
C23H27N5O5S
Mol. Mass.:
485.556
SMILES:
CCCOc1cccc(Oc2cc3n(C)c(=O)n(C)c3cc2NS(=O)(=O)c2cn(C)c(C)n2)c1
: