Target
Transcription intermediary factor 1-alpha
Ligand
BDBM50150814
Substrate
Meas. Tech.
ChEMBL_1560322 (CHEMBL3779314)
EC50
4900±n/a nM
Citation
 Palmer, WSPoncet-Montange, GLiu, GPetrocchi, AReyna, NSubramanian, GTheroff, JYau, AKost-Alimova, MBardenhagen, JPLeo, EShepard, HETieu, TNShi, XZhan, YZhao, SBarton, MCDraetta, GToniatti, CJones, PGeck Do, MAndersen, JN Structure-Guided Design of IACS-9571, a Selective High-Affinity Dual TRIM24-BRPF1 Bromodomain Inhibitor. J Med Chem 59:1440-54 (2016)  
Target
Name:
Transcription intermediary factor 1-alpha
Synonyms:
6.3.2.- RING finger protein 82 RNF82 TIF1-alpha TIF1A_HUMAN Transcription intermediary factor 1-alpha | Tripartite motif-containing protein 24
Type:
PROTEIN
Mol. Mass.:
116839.55
Organism:
Homo sapiens (Human)
Description:
ChEMBL_107998
Residue:
1050
  
Inhibitor
Name:
BDBM50150814
Synonyms:
CHEMBL3775640
Type:
Small organic molecule
Emp. Form.:
C27H27N5O5S
Mol. Mass.:
533.599
SMILES:
Cc1nc(cn1C)S(=O)(=O)Nc1cc2n(C)c(=O)n(C)c2cc1Oc1cccc(OCc2ccccc2)c1
: