Target
Peregrin
Ligand
BDBM50150818
Substrate
Meas. Tech.
ChEMBL_1560327 (CHEMBL3779319)
Kd
14±n/a nM
Citation
 Palmer, WSPoncet-Montange, GLiu, GPetrocchi, AReyna, NSubramanian, GTheroff, JYau, AKost-Alimova, MBardenhagen, JPLeo, EShepard, HETieu, TNShi, XZhan, YZhao, SBarton, MCDraetta, GToniatti, CJones, PGeck Do, MAndersen, JN Structure-Guided Design of IACS-9571, a Selective High-Affinity Dual TRIM24-BRPF1 Bromodomain Inhibitor. J Med Chem 59:1440-54 (2016)  
Target
Name:
Peregrin
Synonyms:
BR140 BRPF1_HUMAN Peregrin | Protein Br140
Type:
PROTEIN
Mol. Mass.:
137524.47
Organism:
Homo sapiens (Human)
Description:
ChEMBL_108054
Residue:
1214
  
Inhibitor
Name:
BDBM50150818
Synonyms:
CHEMBL3774575
Type:
Small organic molecule
Emp. Form.:
C32H42N4O8S
Mol. Mass.:
642.763
SMILES:
CCCOc1cc(OCCCCN(C)C)cc(Oc2cc3n(C)c(=O)n(C)c3cc2NS(=O)(=O)c2ccc(OC)c(OC)c2)c1
: