Target
Nociceptin receptor
Ligand
BDBM50147740
Substrate
Meas. Tech.
ChEMBL_1560574 (CHEMBL3777306)
Ki
1.4±n/a nM
Citation
 Dosa, PIAmin, EA Tactical Approaches to Interconverting GPCR Agonists and Antagonists. J Med Chem 59:810-40 (2016)  
Target
Name:
Nociceptin receptor
Synonyms:
KOR-3 Mu-type opioid receptor (Mu) Nociceptin Receptor (ORL1 Receptor) Nociceptin receptor (ORL-1) Nociceptin/Orphanin FQ, NOP receptor OPIATE ORL-1 OPRL1 protein ORL1 Opioid receptor like-1 Orphanin FQ receptor (ORL1) | P41146
Type:
G Protein-Coupled Receptor (GPCR)
Mol. Mass.:
40702.87
Organism:
Homo sapiens (Human)
Description:
P41146
Residue:
370
  
Inhibitor
Name:
BDBM50147740
Synonyms:
1-(1-Cyclooctyl-piperidin-4-yl)-1,3-dihydro-indol-2-one | CHEMBL101454
Type:
Small organic molecule
Emp. Form.:
C21H30N2O
Mol. Mass.:
326.4757
SMILES:
O=C1Cc2ccccc2N1C1CCN(CC1)C1CCCCCCC1
: