Target
CREB-binding protein
Ligand
BDBM50443249
Substrate
Meas. Tech.
ChEMBL_1561479 (CHEMBL3779616)
IC50
5000±n/a nM
Citation
 Simon, RPRobaa, DAlhalabi, ZSippl, WJung, M KATching-Up on Small Molecule Modulators of Lysine Acetyltransferases. J Med Chem 59:1249-70 (2016)  
Target
Name:
CREB-binding protein
Synonyms:
CBP CREB-binding protein (CBP) CREBBP
Type:
Transcription Coactivator
Mol. Mass.:
265411.66
Organism:
Homo sapiens (Human)
Description:
Q92793
Residue:
2442
  
Inhibitor
Name:
BDBM50443249
Synonyms:
Ischemin
Type:
Small organic molecule
Emp. Form.:
C15H17N3O4S
Mol. Mass.:
335.378
SMILES:
Cc1cc(N=Nc2cc(c(C)cc2C)S(O)(=O)=O)c(N)cc1O
: