Target
Carbonic anhydrase 2
Ligand
BDBM10864
Substrate
Meas. Tech.
ChEMBL_1563413 (CHEMBL3782910)
Ki
40±n/a nM
Citation
 Eminoglu, AVullo, DAsik, AÇolak, DNÇanakçi, SBeldüz, AOSupuran, CT Sulfonamide inhibition studies of theß-carbonic anhydrase from the newly discovered bacterium Enterobacter sp. B13. Bioorg Med Chem Lett 26:1821-6 (2016)  
Target
Name:
Carbonic anhydrase 2
Synonyms:
CA-II CAC Carbonate dehydratase II Carbonic anhydrase 2 (CA-II) Carbonic anhydrase C Carbonic anhydrase II (CA-II) Carbonic anhydrase II (hCA II) | Carbonic anhydrase isoenzyme II (hCA II)
Type:
Enzyme
Mol. Mass.:
29250.71
Organism:
Homo sapiens (Human)
Description:
P00918
Residue:
260
  
Inhibitor
Name:
BDBM10864
Synonyms:
4-Amino-3-bromobenzenesulfonamide CHEMBL6724 halogenosulfanilamide deriv. 5d
Type:
Small organic molecule
Emp. Form.:
C6H7BrN2O2S
Mol. Mass.:
251.101
SMILES:
Nc1ccc(cc1Br)S(N)(=O)=O
: