Target
Solute carrier family 2, facilitated glucose transporter member 2
Ligand
BDBM50155753
Substrate
Meas. Tech.
ChEMBL_1565337 (CHEMBL3782731)
IC50
880±n/a nM
Citation
 Siebeneicher, HBauser, MBuchmann, BHeisler, IMüller, TNeuhaus, RRehwinkel, HTelser, JZorn, L Identification of novel GLUT inhibitors. Bioorg Med Chem Lett 26:1732-7 (2016)  
Target
Name:
Solute carrier family 2, facilitated glucose transporter member 2
Synonyms:
GLUT2 SLC2A2
Type:
PROTEIN
Mol. Mass.:
57494.38
Organism:
Homo sapiens (Human)
Description:
ChEMBL_599700
Residue:
524
  
Inhibitor
Name:
BDBM50155753
Synonyms:
CHEMBL3780470
Type:
Small organic molecule
Emp. Form.:
C23H23FN6O2
Mol. Mass.:
434.4661
SMILES:
COc1ccccc1N1CCN(CC1)c1ncnc2n(ncc12)-c1cc(F)ccc1OC
: