Target
Kallikrein-5 [D153N]
Ligand
BDBM50154254
Substrate
Meas. Tech.
ChEMBL_1560427 (CHEMBL3776088)
Ki
120±n/a nM
Citation
 Hoelz, LVZorzanelli, BCAzevedo, PHPassos, SGde Souza, LRZani, MPinheiro, SPuzer, LDias, LRMuri, EM Synthesis, biological evaluation and molecular modeling of pseudo-peptides based statine as inhibitors for human tissue kallikrein 5. Eur J Med Chem 112:39-47 (2016)  
Target
Name:
Kallikrein-5 [D153N]
Synonyms:
KLK-L2 KLK5_HUMAN Kallikrein-5 SCTE | Stratum corneum tryptic enzyme
Type:
PROTEIN
Mol. Mass.:
32031.75
Organism:
Homo sapiens (Human)
Description:
ChEMBL_1282456
Residue:
293
  
Inhibitor
Name:
BDBM50154254
Synonyms:
CHEMBL3775705
Type:
Small organic molecule
Emp. Form.:
C26H34N2O6
Mol. Mass.:
470.558
SMILES:
COC(=O)[C@H](Cc1ccccc1)NC(=O)C[C@H](O)[C@H](Cc1ccccc1)NC(=O)OC(C)(C)C
: