Target
Prostaglandin G/H synthase 2
Ligand
BDBM50207446
Substrate
Meas. Tech.
ChEMBL_1560770 (CHEMBL3778467)
IC50
60±n/a nM
Citation
 Tietz, ODzandzi, JBhardwaj, AValliant, JFWuest, F Design and synthesis of [(125)I]Pyricoxib: A novel (125)I-labeled cyclooxygenase-2 (COX-2) inhibitors. Bioorg Med Chem Lett 26:1516-20 (2016)  
Target
Name:
Prostaglandin G/H synthase 2
Synonyms:
COX2 Cyclooxygenase 2 (COX-2) Cyclooxygenase-2 (COX-2 AA) Cyclooxygenase-2 (COX-2) PGH2_HUMAN PHS II Prostaglandin E synthase/G/H synthase 2 Prostaglandin-endoperoxide synthase 2
Type:
Enzyme
Mol. Mass.:
69003.89
Organism:
Homo sapiens (Human)
Description:
Recombinant Cox-2 provided by Cayman (Cayman Chemical Co.,Ann Arbor, MI).
Residue:
604
  
Inhibitor
Name:
BDBM50207446
Synonyms:
2-(2-(2-chloro-6-fluorophenylamino)-5-methylphenyl)acetic acid | CHEMBL404108
Type:
Small organic molecule
Emp. Form.:
C15H13ClFNO2
Mol. Mass.:
293.721
SMILES:
Cc1ccc(Nc2c(F)cccc2Cl)c(CC(O)=O)c1
: