Target
Endothelin-1 receptor
Ligand
BDBM50155246
Substrate
Meas. Tech.
ChEMBL_1559764 (CHEMBL3779717)
IC50
0.023±n/a nM
Citation
 Waszkielewicz, AMGunia-Krzyzak, APowroznik, BSloczynska, KPekala, EWalczak, MBednarski, MZeslawska, ENitek, WMarona, H Design, physico-chemical properties and biological evaluation of some new N-[(phenoxy)alkyl]- and N-{2-[2-(phenoxy)ethoxy]ethyl}aminoalkanols as anticonvulsant agents. Bioorg Med Chem 24:1793-810 (2016)  
Target
Name:
Endothelin-1 receptor
Synonyms:
EDNRA ET-A ETA-R Endothelin receptor type A hET-AR
Type:
Enzyme Catalytic Domain
Mol. Mass.:
48736.88
Organism:
Homo sapiens (Human)
Description:
P25101
Residue:
427
  
Inhibitor
Name:
BDBM50155246
Synonyms:
CHEMBL3775234
Type:
Small organic molecule
Emp. Form.:
C109H159N25O32S5
Mol. Mass.:
2491.902
SMILES:
[H][C@]12CSSC[C@]([H])(NC(=O)[C@H](CCC(O)=O)NC(=O)[C@H](CCCCN)NC(=O)[C@H](CC(O)=O)NC(=O)[C@H](CCSC)NC(=O)[C@H](CC(C)C)NC(=O)[C@H](CO)NC(=O)[C@H](CO)NC1=O)C(=O)N[C@@H](C(C)C)C(=O)N[C@@H](Cc1ccc(O)cc1)C(=O)N[C@@H](Cc1ccccc1)C(=O)N[C@@H](CSSC[C@H](N)C(=O)N[C@@H](CO)C(=O)N2)C(=O)N[C@@H](Cc1cnc[nH]1)C(=O)N[C@@H](CC(C)C)C(=O)N[C@@H](CC(O)=O)C(=O)N[C@@H]([C@@H](C)CC)C(=O)N[C@@H]([C@@H](C)CC)C(=O)N[C@@H](Cc1c[nH]c2ccccc12)C(O)=O
: