Target
Sodium-dependent dopamine transporter
Ligand
BDBM50005534
Substrate
Meas. Tech.
ChEMBL_1559991 (CHEMBL3777269)
IC50
2.8±n/a nM
Citation
 Waszkielewicz, AMGunia-Krzyzak, APowroznik, BSloczynska, KPekala, EWalczak, MBednarski, MZeslawska, ENitek, WMarona, H Design, physico-chemical properties and biological evaluation of some new N-[(phenoxy)alkyl]- and N-{2-[2-(phenoxy)ethoxy]ethyl}aminoalkanols as anticonvulsant agents. Bioorg Med Chem 24:1793-810 (2016)  
Target
Name:
Sodium-dependent dopamine transporter
Synonyms:
DA transporter DAT1 Dopamine transporter protein (DAT) SC6A3_HUMAN Sodium-dependent dopamine transporter Solute carrier family 6 member 3
Type:
Multi-pass membrane protein
Mol. Mass.:
68497.11
Organism:
Homo sapiens (Human)
Description:
Q01959
Residue:
620
  
Inhibitor
Name:
BDBM50005534
Synonyms:
1-(1-(benzo[b]thiophen-2-yl)cyclohexyl)piperidine 1-(1-Benzo[b]thiophen-2-yl-cyclohexyl)-piperidine(BTCP) 3-[(3-Chloro-phenyl)-phenyl-methoxy]-8-methyl-8-aza-bicyclo[3.2.1]octane | CHEMBL279556
Type:
Small organic molecule
Emp. Form.:
C19H25NS
Mol. Mass.:
299.474
SMILES:
C1CCN(CC1)C1(CCCCC1)c1cc2ccccc2s1
: