Target
Small conductance calcium-activated potassium channel protein 1/2/3
Ligand
BDBM50155248
Substrate
Meas. Tech.
ChEMBL_1559987 (CHEMBL3777023)
IC50
0.016±n/a nM
Citation
 Waszkielewicz, AMGunia-Krzyzak, APowroznik, BSloczynska, KPekala, EWalczak, MBednarski, MZeslawska, ENitek, WMarona, H Design, physico-chemical properties and biological evaluation of some new N-[(phenoxy)alkyl]- and N-{2-[2-(phenoxy)ethoxy]ethyl}aminoalkanols as anticonvulsant agents. Bioorg Med Chem 24:1793-810 (2016)  
Target
Name:
Small conductance calcium-activated potassium channel protein 1/2/3
Synonyms:
Small conductance calcium-activated potassium channel
Type:
Mol. Mass.:
Description:
ASSAY_ID of ChEMBL is 1559987
Components:
This complex has 3 components.
Component 1
Name:
Small conductance calcium-activated potassium channel protein 3
Synonyms:
KCNN3_RAT SK3 | Small conductance calcium-activated potassium channel
Type:
PROTEIN
Mol. Mass.:
81476.29
Organism:
Rattus norvegicus
Description:
ChEMBL_494975
Residue:
732
  
Component 2
Name:
Small conductance calcium-activated potassium channel protein 1
Synonyms:
KCNN1_RAT Potassium Channel, Ca2+ Act., VS Small conductance calcium-activated potassium channel
Type:
Enzyme Catalytic Domain
Mol. Mass.:
59231.59
Organism:
RAT
Description:
Potassium Channel, Ca2+ Act., VS 0 RAT::P70606
Residue:
536
  
Component 3
Name:
Small conductance calcium-activated potassium channel protein 2
Synonyms:
KCNN2_RAT Small conductance calcium-activated potassium channel Small conductance calcium-activated potassium channel protein 2 (KCa2.2)
Type:
Protein
Mol. Mass.:
63876.72
Organism:
Rattus norvegicus (Rat)
Description:
P70604
Residue:
580
  
Inhibitor
Name:
BDBM50155248
Synonyms:
CHEMBL3774478
Type:
Small organic molecule
Emp. Form.:
C79H131N31O24S4
Mol. Mass.:
2027.339
SMILES:
[H][C@@]12CCCN1C(=O)[C@H](C)NC(=O)[C@H](CCCCN)NC(=O)[C@@]1([H])CSSC[C@H](NC(=O)[C@H](CCCNC(N)=N)NC(=O)[C@H](CCCNC(N)=N)NC(=O)[C@H](C)NC(=O)[C@]([H])(CSSC[C@@H](N)C(=O)N[C@@H](CC(N)=O)C(=O)N1)NC(=O)[C@H](CC(C)C)NC(=O)[C@H](C)NC(=O)[C@@]([H])(NC(=O)[C@H](CCC(O)=O)NC2=O)[C@@H](C)O)C(=O)N[C@@H](CCC(N)=O)C(=O)N[C@@H](CCC(N)=O)C(=O)N[C@@H](Cc1cnc[nH]1)C(N)=O
: