Target
Substance-K receptor
Ligand
BDBM50155253
Substrate
Meas. Tech.
ChEMBL_1559777 (CHEMBL3779730)
IC50
3.5±n/a nM
Citation
 Waszkielewicz, AMGunia-Krzyzak, APowroznik, BSloczynska, KPekala, EWalczak, MBednarski, MZeslawska, ENitek, WMarona, H Design, physico-chemical properties and biological evaluation of some new N-[(phenoxy)alkyl]- and N-{2-[2-(phenoxy)ethoxy]ethyl}aminoalkanols as anticonvulsant agents. Bioorg Med Chem 24:1793-810 (2016)  
Target
Name:
Substance-K receptor
Synonyms:
NK-2 receptor NK2R NKNAR Neurokinin A receptor Neurokinin-2 (NK-2) SKR TACR2 Tachykinin receptor 2 (NK2) | hnk-3
Type:
Protein
Mol. Mass.:
44455.78
Organism:
Homo sapiens (Human)
Description:
P21452
Residue:
398
  
Inhibitor
Name:
BDBM50155253
Synonyms:
CHEMBL3775108
Type:
Small organic molecule
Emp. Form.:
C35H56N8O10
Mol. Mass.:
748.8667
SMILES:
CCCCC(NC(=O)[C@H](CC(C)C)NC(=O)CNC(=O)[C@@H](NC(=O)[C@H](Cc1ccccc1)NC(=O)[C@H](CO)NC(=O)[C@@H](N)CC(O)=O)C(C)C)C(N)=O
: