Target
REST corepressor 1 [4-485]
Ligand
BDBM50155773
Substrate
Meas. Tech.
ChEMBL_1564915 (CHEMBL3782872)
IC50
6.5±n/a nM
Citation
 Vianello, PBotrugno, OACappa, ADal Zuffo, RDessanti, PMai, AMarrocco, BMattevi, AMeroni, GMinucci, SStazi, GThaler, FTrifiró, PValente, SVilla, MVarasi, MMercurio, C Discovery of a Novel Inhibitor of Histone Lysine-Specific Demethylase 1A (KDM1A/LSD1) as Orally Active Antitumor Agent. J Med Chem 59:1501-17 (2016)  
Target
Name:
REST corepressor 1 [4-485]
Synonyms:
KIAA0071 RCOR RCOR1_HUMAN | REST corepressor 1
Type:
PROTEIN
Mol. Mass.:
53029.95
Organism:
Homo sapiens (Human)
Description:
ChEMBL_108118
Residue:
482
  
Inhibitor
Name:
BDBM50155773
Synonyms:
CHEMBL3781751 | US9469597, 5
Type:
Small organic molecule
Emp. Form.:
C15H22N2
Mol. Mass.:
230.3486
SMILES:
[H][C@@]1(CC[C@H](N)CC1)N[C@@H]1C[C@H]1c1ccccc1
: