Target
5-hydroxytryptamine receptor 6
Ligand
BDBM50156197
Substrate
Meas. Tech.
ChEMBL_1563720 (CHEMBL3783931)
IC50
1.3±n/a nM
Citation
 Blass, B Sulfonamide Derivatives and Pharmaceutical Applications Thereof. ACS Med Chem Lett 7:12-4 (2016)  
Target
Name:
5-hydroxytryptamine receptor 6
Synonyms:
5-HT-6 5-hydroxytryptamine receptor 6 (5-HT-6) 5-hydroxytryptamine receptor 6 (5HT6) HTR6 Serotonin 6 (5-HT6) receptor | Serotonin Receptor 6
Type:
G Protein-Coupled Receptor (GPCR)
Mol. Mass.:
46968.43
Organism:
Homo sapiens (Human)
Description:
P50406
Residue:
440
  
Inhibitor
Name:
BDBM50156197
Synonyms:
CHEMBL3781239
Type:
Small organic molecule
Emp. Form.:
C24H28FN3O3S
Mol. Mass.:
457.561
SMILES:
COc1ccc(cc1N1CCN(C)CC1)S(=O)(=O)NCCc1cccc2cc(F)ccc12
: