Target
5-hydroxytryptamine receptor 6
Ligand
BDBM50156207
Substrate
Meas. Tech.
ChEMBL_1563720 (CHEMBL3783931)
IC50
1.4±n/a nM
Citation
 Blass, B Sulfonamide Derivatives and Pharmaceutical Applications Thereof. ACS Med Chem Lett 7:12-4 (2016)  
Target
Name:
5-hydroxytryptamine receptor 6
Synonyms:
5-HT-6 5-hydroxytryptamine receptor 6 (5-HT-6) 5-hydroxytryptamine receptor 6 (5HT6) HTR6 Serotonin 6 (5-HT6) receptor | Serotonin Receptor 6
Type:
G Protein-Coupled Receptor (GPCR)
Mol. Mass.:
46968.43
Organism:
Homo sapiens (Human)
Description:
P50406
Residue:
440
  
Inhibitor
Name:
BDBM50156207
Synonyms:
CHEMBL3780011
Type:
Small organic molecule
Emp. Form.:
C27H35N3O4S
Mol. Mass.:
497.65
SMILES:
COc1ccc2cccc(c2c1)C(C)(C)CNS(=O)(=O)c1ccc(OC)c(c1)N1CCN(C)CC1
: