Target
5-hydroxytryptamine receptor 6
Ligand
BDBM50156219
Substrate
Meas. Tech.
ChEMBL_1563720 (CHEMBL3783931)
IC50
5.0±n/a nM
Citation
 Blass, B Sulfonamide Derivatives and Pharmaceutical Applications Thereof. ACS Med Chem Lett 7:12-4 (2016)  
Target
Name:
5-hydroxytryptamine receptor 6
Synonyms:
5-HT-6 5-hydroxytryptamine receptor 6 (5-HT-6) 5-hydroxytryptamine receptor 6 (5HT6) HTR6 Serotonin 6 (5-HT6) receptor | Serotonin Receptor 6
Type:
G Protein-Coupled Receptor (GPCR)
Mol. Mass.:
46968.43
Organism:
Homo sapiens (Human)
Description:
P50406
Residue:
440
  
Inhibitor
Name:
BDBM50156219
Synonyms:
CHEMBL3781772
Type:
Small organic molecule
Emp. Form.:
C26H31N3O4S
Mol. Mass.:
481.607
SMILES:
COc1ccc2cccc(c2c1)C1(CNS(=O)(=O)c2ccc(OC)c(c2)N2CCNCC2)CC1
: