Target
Trace amine-associated receptor 1
Ligand
BDBM50158477
Substrate
Meas. Tech.
ChEMBL_1563108 (CHEMBL3783756)
EC50
29±n/a nM
Citation
 Galley, GBeurier, ADécoret, GGoergler, AHutter, RMohr, SPähler, ASchmid, PTürck, DUnger, RZbinden, KGHoener, MCNorcross, RD Discovery and Characterization of 2-Aminooxazolines as Highly Potent, Selective, and Orally Active TAAR1 Agonists. ACS Med Chem Lett 7:192-7 (2016)  
Target
Name:
Trace amine-associated receptor 1
Synonyms:
TA1 TAAR1_HUMAN TRAR1 | trace amine-associated receptor 1
Type:
PROTEIN
Mol. Mass.:
39107.47
Organism:
Homo sapiens (Human)
Description:
ChEMBL_792734
Residue:
339
  
Inhibitor
Name:
BDBM50158477
Synonyms:
CHEMBL3780932
Type:
Small organic molecule
Emp. Form.:
C12H16ClN3O
Mol. Mass.:
253.728
SMILES:
CCN(C[C@H]1COC(N)=N1)c1cccc(Cl)c1
: