Target
Trace amine-associated receptor 1
Ligand
BDBM50158480
Substrate
Meas. Tech.
ChEMBL_1563108 (CHEMBL3783756)
EC50
27±n/a nM
Citation
 Galley, GBeurier, ADécoret, GGoergler, AHutter, RMohr, SPähler, ASchmid, PTürck, DUnger, RZbinden, KGHoener, MCNorcross, RD Discovery and Characterization of 2-Aminooxazolines as Highly Potent, Selective, and Orally Active TAAR1 Agonists. ACS Med Chem Lett 7:192-7 (2016)  
Target
Name:
Trace amine-associated receptor 1
Synonyms:
TA1 TAAR1_HUMAN TRAR1 | trace amine-associated receptor 1
Type:
PROTEIN
Mol. Mass.:
39107.47
Organism:
Homo sapiens (Human)
Description:
ChEMBL_792734
Residue:
339
  
Inhibitor
Name:
BDBM50158480
Synonyms:
CHEMBL3780421
Type:
Small organic molecule
Emp. Form.:
C12H16N2O
Mol. Mass.:
204.2682
SMILES:
NC1=N[C@@H](CCCc2ccccc2)CO1
: