Target
Trace amine-associated receptor 1
Ligand
BDBM109487
Substrate
Meas. Tech.
ChEMBL_1563108 (CHEMBL3783756)
EC50
41±n/a nM
Citation
 Galley, GBeurier, ADécoret, GGoergler, AHutter, RMohr, SPähler, ASchmid, PTürck, DUnger, RZbinden, KGHoener, MCNorcross, RD Discovery and Characterization of 2-Aminooxazolines as Highly Potent, Selective, and Orally Active TAAR1 Agonists. ACS Med Chem Lett 7:192-7 (2016)  
Target
Name:
Trace amine-associated receptor 1
Synonyms:
TA1 TAAR1_HUMAN TRAR1 | trace amine-associated receptor 1
Type:
PROTEIN
Mol. Mass.:
39107.47
Organism:
Homo sapiens (Human)
Description:
ChEMBL_792734
Residue:
339
  
Inhibitor
Name:
BDBM109487
Synonyms:
US8604061, 231
Type:
Small organic molecule
Emp. Form.:
C10H11BrN2O
Mol. Mass.:
255.111
SMILES:
C[C@@]1(COC(N)=N1)c1ccc(Br)cc1
: