Target
Trace amine-associated receptor 1
Ligand
BDBM50158471
Substrate
Meas. Tech.
ChEMBL_1563108 (CHEMBL3783756)
EC50
17±n/a nM
Citation
 Galley, GBeurier, ADécoret, GGoergler, AHutter, RMohr, SPähler, ASchmid, PTürck, DUnger, RZbinden, KGHoener, MCNorcross, RD Discovery and Characterization of 2-Aminooxazolines as Highly Potent, Selective, and Orally Active TAAR1 Agonists. ACS Med Chem Lett 7:192-7 (2016)  
Target
Name:
Trace amine-associated receptor 1
Synonyms:
TA1 TAAR1_HUMAN TRAR1 | trace amine-associated receptor 1
Type:
PROTEIN
Mol. Mass.:
39107.47
Organism:
Homo sapiens (Human)
Description:
ChEMBL_792734
Residue:
339
  
Inhibitor
Name:
BDBM50158471
Synonyms:
CHEMBL3781694
Type:
Small organic molecule
Emp. Form.:
C10H11FN2O
Mol. Mass.:
194.2055
SMILES:
Cc1c(F)cccc1[C@H]1COC(N)=N1
: