Target
Trace amine-associated receptor 1
Ligand
BDBM109348
Substrate
Meas. Tech.
ChEMBL_1563111 (CHEMBL3783759)
EC50
87±n/a nM
Citation
 Galley, GBeurier, ADécoret, GGoergler, AHutter, RMohr, SPähler, ASchmid, PTürck, DUnger, RZbinden, KGHoener, MCNorcross, RD Discovery and Characterization of 2-Aminooxazolines as Highly Potent, Selective, and Orally Active TAAR1 Agonists. ACS Med Chem Lett 7:192-7 (2016)  
Target
Name:
Trace amine-associated receptor 1
Synonyms:
TAAR1_RAT Taar1 Trace amine receptor 1 (TARR1) Trace amine-associated receptor 1 (TAAR1) Trar1
Type:
Enzyme
Mol. Mass.:
38034.73
Organism:
Rattus norvegicus (Rat)
Description:
Q923Y9
Residue:
332
  
Inhibitor
Name:
BDBM109348
Synonyms:
US8604061, 4
Type:
Small organic molecule
Emp. Form.:
C9H9ClN2O
Mol. Mass.:
196.634
SMILES:
NC1=N[C@H](CO1)c1ccccc1Cl
: