Target
Peregrin
Ligand
BDBM50158910
Substrate
Meas. Tech.
ChEMBL_1566570 (CHEMBL3791464)
Kd
5900±n/a nM
Citation
 Hügle, MLucas, XWeitzel, GOstrovskyi, DBreit, BGerhardt, SEinsle, OGünther, SWohlwend, D 4-Acyl Pyrrole Derivatives Yield Novel Vectors for Designing Inhibitors of the Acetyl-Lysine Recognition Site of BRD4(1). J Med Chem 59:1518-30 (2016)  
Target
Name:
Peregrin
Synonyms:
BR140 BRPF1_HUMAN Peregrin | Protein Br140
Type:
PROTEIN
Mol. Mass.:
137524.47
Organism:
Homo sapiens (Human)
Description:
ChEMBL_108054
Residue:
1214
  
Inhibitor
Name:
BDBM50158910
Synonyms:
CHEMBL3786406
Type:
Small organic molecule
Emp. Form.:
C19H25N3O5S
Mol. Mass.:
407.484
SMILES:
CCN(CC)S(=O)(=O)c1ccc(O)c(NC(=O)c2[nH]c(C)c(C(C)=O)c2C)c1
: