Target
Metabotropic glutamate receptor 2
Ligand
BDBM50252050
Substrate
Meas. Tech.
ChEMBL_1568361 (CHEMBL3789014)
EC50
>1000000±n/a nM
Citation
 Huynh, THErichsen, MNTora, ASGoudet, CSagot, EAssaf, ZThomsen, CBrodbeck, RStensbøl, TBBjørn-Yoshimoto, WENielsen, BPin, JPGefflaut, TBunch, L New 4-Functionalized Glutamate Analogues Are Selective Agonists at Metabotropic Glutamate Receptor Subtype 2 or Selective Agonists at Metabotropic Glutamate Receptor Group III. J Med Chem 59:914-24 (2016)  
Target
Name:
Metabotropic glutamate receptor 2
Synonyms:
GPRC1B GRM2_HUMAN Metabotropic glutamate receptor mGlu2 | metabotropic glutamate 2
Type:
Enzyme
Mol. Mass.:
95584.88
Organism:
Homo sapiens (Human)
Description:
Q14416
Residue:
872
  
Inhibitor
Name:
BDBM50252050
Synonyms:
(2S,4R)-2-amino-4-(3-amino-3-oxopropyl)pentanedioic acid CHEMBL479804
Type:
Small organic molecule
Emp. Form.:
C8H14N2O5
Mol. Mass.:
218.2072
SMILES:
N[C@@H](C[C@@H](CCC(N)=O)C(O)=O)C(O)=O
: