Target
Metabotropic glutamate receptor 6
Ligand
BDBM50159150
Substrate
Meas. Tech.
ChEMBL_1568371 (CHEMBL3789024)
EC50
>1000000±n/a nM
Citation
 Huynh, THErichsen, MNTora, ASGoudet, CSagot, EAssaf, ZThomsen, CBrodbeck, RStensbøl, TBBjørn-Yoshimoto, WENielsen, BPin, JPGefflaut, TBunch, L New 4-Functionalized Glutamate Analogues Are Selective Agonists at Metabotropic Glutamate Receptor Subtype 2 or Selective Agonists at Metabotropic Glutamate Receptor Group III. J Med Chem 59:914-24 (2016)  
Target
Name:
Metabotropic glutamate receptor 6
Synonyms:
GRM6_RAT Grm6 Metabotropic glutamate receptor 6 (mGlu6) mGlu6 | metabotropic glutamate 6
Type:
Enzyme
Mol. Mass.:
95095.82
Organism:
Rattus norvegicus (Rat)
Description:
P35349
Residue:
871
  
Inhibitor
Name:
BDBM50159150
Synonyms:
CHEMBL3787264
Type:
Small organic molecule
Emp. Form.:
C8H11NO6
Mol. Mass.:
217.176
SMILES:
[H][C@@]1(C[C@]1(C[C@H](N)C(O)=O)C(O)=O)C(O)=O
: