Target
C-X-C chemokine receptor type 3
Ligand
BDBM50159705
Substrate
Meas. Tech.
ChEMBL_1569710 (CHEMBL3791415)
EC50
166±n/a nM
Citation
 Milanos, LBrox, RFrank, TPoklukar, GPalmisano, RWaibel, REinsiedel, JDürr, MIvanovic-Burmazovic, ILarsen, OHjortø, GMRosenkilde, MMTschammer, N Discovery and Characterization of Biased Allosteric Agonists of the Chemokine Receptor CXCR3. J Med Chem 59:2222-43 (2016)  
Target
Name:
C-X-C chemokine receptor type 3
Synonyms:
AAO92295.1 C-X-C chemokine receptor type 3 (CXCR3) CXCR3 CXCR3_HUMAN chemokine (C-X-C motif) receptor 3
Type:
Enzyme Catalytic Domain
Mol. Mass.:
40665.65
Organism:
Homo sapiens (Human)
Description:
Residue:
368
  
Inhibitor
Name:
BDBM50159705
Synonyms:
CHEMBL3786864
Type:
Small organic molecule
Emp. Form.:
C40H50N4O6
Mol. Mass.:
682.8482
SMILES:
CC(=O)CCC(=O)N1Cc2ccccc2C[C@H]1C(=O)NCCCC[C@H](NC(=O)OC(C)(C)C)C(=O)NCC(c1ccccc1)c1ccccc1
: