Target
Glutamate carboxypeptidase 2
Ligand
BDBM50160305
Substrate
Meas. Tech.
ChEMBL_1566974 (CHEMBL3791236)
IC50
3.0±n/a nM
Citation
 Genady, ARJanzen, NBanevicius, LEl-Gamal, MEl-Zaria, MEValliant, JF Preparation and Evaluation of Radiolabeled Antibody Recruiting Small Molecules That Target Prostate-Specific Membrane Antigen for Combined Radiotherapy and Immunotherapy. J Med Chem 59:2660-73 (2016)  
Target
Name:
Glutamate carboxypeptidase 2
Synonyms:
FGCP FOLH1 Folate hydrolase 1 Glutamate carboxypeptidase 2 Membrane glutamate carboxypeptidase NAALAD1 PSM Prostate-specific membrane antigen mGCP
Type:
PROTEIN
Mol. Mass.:
84333.66
Organism:
Homo sapiens (Human)
Description:
ChEMBL_1497035
Residue:
750
  
Inhibitor
Name:
BDBM50160305
Synonyms:
CHEMBL3786632
Type:
Small organic molecule
Emp. Form.:
C23H28IN9O12
Mol. Mass.:
749.426
SMILES:
OC(=O)CC[C@H](NC(=O)N[C@@H](CCCCNC(=O)Cn1nnc(I)c1CNc1ccc(cc1[N+]([O-])=O)[N+]([O-])=O)C(O)=O)C(O)=O
: