Target
Potassium voltage-gated channel subfamily H member 2
Ligand
BDBM50160699
Substrate
Meas. Tech.
ChEMBL_1566421 (CHEMBL3790041)
IC50
>33000±n/a nM
Citation
 Kajanus, JJacobson, IÅstrand, AOlsson, RIGran, UBjöre, AFjellström, ODavidsson, ÖEmtenäs, HDahlén, ALöfberg, BYuan, ZQSundell, JCassel, JGyll, JIliefski, THögberg, ÅLindhardt, EMalmberg, J Isoindolinone compounds active as Kv1.5 blockers identified using a multicomponent reaction approach. Bioorg Med Chem Lett 26:2023-9 (2016)  
Target
Name:
Potassium voltage-gated channel subfamily H member 2
Synonyms:
1,3-beta-glucan synthase component GLS2 ERG Eag-related protein 1 Ether-a-go-go-related gene (HERG) Ether-a-go-go-related gene potassium channel 1 Ether-a-go-go-related gene potassium channel 1 (hERG1) Ether-a-go-go-related protein 1 H-ERG KCNH2 Potassium voltage-gated channel subfamily H member 2 (hERG) Voltage-gated potassium channel subunit Kv11.1 hERG Potassium Channel 1 | putative potassium channel subunit
Type:
Multi-pass membrane protein
Mol. Mass.:
126672.65
Organism:
Homo sapiens (Human)
Description:
Q12809
Residue:
1159
  
Inhibitor
Name:
BDBM50160699
Synonyms:
CHEMBL3786460
Type:
Small organic molecule
Emp. Form.:
C26H24F2N2O2
Mol. Mass.:
434.4778
SMILES:
CC(C)(C)NC(=O)C1N(Cc2ccccc2-c2ccc(F)c(F)c2)C(=O)c2ccccc12
: