Target
Beta-glucuronidase
Ligand
BDBM50160580
Substrate
Meas. Tech.
ChEMBL_1565959 (CHEMBL3790643)
IC50
32160±n/a nM
Citation
 Salar, UTaha, MIsmail, NHKhan, KMImran, SPerveen, SWadood, ARiaz, M Thiadiazole derivatives as New Class of฿-glucuronidase inhibitors. Bioorg Med Chem 24:1909-18 (2016)  
Target
Name:
Beta-glucuronidase
Synonyms:
Beta-glucuronidase EMBL:AAI33416.1 Ensembl:ENSBTAP00000000941} | GUSB
Type:
Protein
Mol. Mass.:
74467.69
Organism:
Bos taurus (Bovine)
Description:
EC 3.2.1.31, bovine liver
Residue:
652
  
Inhibitor
Name:
BDBM50160580
Synonyms:
CHEMBL3785812
Type:
Small organic molecule
Emp. Form.:
C18H18BrN3S
Mol. Mass.:
388.325
SMILES:
CC(C)(C)c1ccc(cc1)-c1nnc(Nc2ccc(Br)cc2)s1
: