Target
Metallo-beta-lactamase type 2
Ligand
BDBM21642
Substrate
Meas. Tech.
ChEMBL_1567885 (CHEMBL3789280)
IC50
50119±n/a nM
Citation
 Christopeit, TLeiros, HK Fragment-based discovery of inhibitor scaffolds targeting the metallo-ß-lactamases NDM-1 and VIM-2. Bioorg Med Chem Lett 26:1973-7 (2016)  
Target
Name:
Metallo-beta-lactamase type 2
Synonyms:
B2 metallo-beta-lactamase Beta-lactamase NDM-1 Metallo-beta-lactamase NDM-1 Metallo-beta-lactamase type II New Delhi metallo-beta-lactamase-1 | blaNDM-1
Type:
PROTEIN
Mol. Mass.:
28498.15
Organism:
Klebsiella pneumoniae
Description:
ChEMBL_103887
Residue:
270
  
Inhibitor
Name:
BDBM21642
Synonyms:
(2S)-1-[(2S)-2-methyl-3-sulfanylpropanoyl]pyrrolidine-2-carboxylic acid Capozide Lopirin SQ14534 | US11491146, Compound L-Captopril
Type:
Small organic molecule
Emp. Form.:
C9H15NO3S
Mol. Mass.:
217.285
SMILES:
C[C@H](CS)C(=O)N1CCC[C@H]1C(O)=O
: