Target
Metallo-beta-lactamase type 2
Ligand
BDBM50129065
Substrate
Meas. Tech.
ChEMBL_1567885 (CHEMBL3789280)
IC50
478630±n/a nM
Citation
 Christopeit, TLeiros, HK Fragment-based discovery of inhibitor scaffolds targeting the metallo-ß-lactamases NDM-1 and VIM-2. Bioorg Med Chem Lett 26:1973-7 (2016)  
Target
Name:
Metallo-beta-lactamase type 2
Synonyms:
B2 metallo-beta-lactamase Beta-lactamase NDM-1 Metallo-beta-lactamase NDM-1 Metallo-beta-lactamase type II New Delhi metallo-beta-lactamase-1 | blaNDM-1
Type:
PROTEIN
Mol. Mass.:
28498.15
Organism:
Klebsiella pneumoniae
Description:
ChEMBL_103887
Residue:
270
  
Inhibitor
Name:
BDBM50129065
Synonyms:
CHEMBL3278535
Type:
Small organic molecule
Emp. Form.:
C10H5NO2
Mol. Mass.:
171.1522
SMILES:
O=c1c(coc2ccccc12)C#N
: